BDBM50497822 CHEMBL3318895
SMILES [H][C@]12CCN(C)[C@@]1([H])C[C@H](CC2)OCCOC
InChI Key InChIKey=QFMIFNPQAHGAST-SRVKXCTJSA-N
Data  3 KI  2 IC50
  Tab Delimited (TSV)   2D SDfile   Computed 3D by Vconf -m prep SDfile
Find this compound or compounds like it in BindingDB:
Activity Spreadsheet -- Enzyme Inhibition Constant Data from BindingDB
Found 2 hits for monomerid = 50497822
TargetNeuronal acetylcholine receptor subunit alpha-3/beta-4(Rattus norvegicus (Rat))
University Of Copenhagen
Curated by ChEMBL
LigandPNGBDBM50497822(CHEMBL3318895)
Affinity DataKi:  3.00E+5nM. Assay description: Displacement of [3H]epibatidine from rat alpha3beta4 nAChR transfected in HEK293 cells after 4 hrs by scintillation count analysis
Ligand InfoPC cidPC sid
In DepthDetails ArticlePubMed
TargetNeuronal acetylcholine receptor subunit alpha-3/beta-4(Rattus norvegicus (Rat))
University Of Copenhagen
Curated by ChEMBL
LigandPNGBDBM50497822(CHEMBL3318895)
Affinity DataIC50: >3.00E+5nM. Assay description: Antagonist activity at rat alpha3beta4 nAChR transfected in HEK293 cells by FLIPR membrane potential blue (FMP) assay
Ligand InfoPC cidPC sid
In DepthDetails ArticlePubMed